Vai al contenuto





Cerca nel Forum

Showing results for tags 'hardware test'.



More search options

  • Search By Tags

    Inserisci eventuali tag separati da virgole.
  • Search By Author

Tipo di contenuto


Forum

  • Salottino
    • Ciao a tutti, mi presento!
    • Salottino
    • A proposito di Apple...
    • Ultime notizie
    • Tutorial
  • Aiuto
    • Domande su Mac - Software
    • Domande su Mac - Hardware
    • Domande su iPhone
    • Domande su iPad
    • Domande su iPod
    • Domande su Apple Watch
    • Domande stupide
  • Creare
    • Fotografia
    • 3D e Architettura
    • Editing video
    • Xcode e Swift
    • Programmazione
    • Grafica
    • Fare musica
    • Webmaster e WordPress
    • Sistemisti
  • Friends
    • Amicizia, amore e sentimenti
    • TV, cinema, libri e musica
    • Sport e motori
    • Gaming
    • Fitness, salute, ambiente
    • Studio e lavoro
  • Aliens
    • Windows
    • Android

Categorie

  • Vendo usato
    • Vendo iPhone usato
    • Vendo iPad usato
    • Vendo Mac Portatile
    • Vendo Mac Desktop
    • Vendo oggetto Apple usato
    • Vendo oggetto usato di altre marche
  • Cerco usato
    • Cerco oggetto Apple usato
    • Cerco oggetto usato di altre marche
  • Scambio usato
    • Scambio oggetto Apple usato
    • Scambio oggetto usato di altre marche

Find results in...

Find results that contain...


Data di creazione

  • Start

    End


Ultimo Aggiornamento

  • Start

    End


Filter by number of...

Iscritto

  • Start

    End


Gruppo


Luogo


Sesso


Situazione sentimentale


Citazioni preferite

Trovato 2 risultati

  1. Ciao a tutti, Sto scrivendo su questo forum perché ho un problema con il mio MacBook Pro 13” del 2011. In seguito a un problema (descritto sotto) ho fatto un test completo dell’hardware che mi da come errore: 4MEM/62/40000000: 0x84eaa518 A cosa è dovuto secondo voi? Come dovrei comportarmi? Grazie in anticipo. Maggiori informazioni: Ho deciso di fare il test perché il Mac continua ad impallarmi apparentemente a caso. Alcune volte è necessario spegnerlo dal tasto fisico altre volte si risolve da solo. Ho fatto il test dell’hardware 4 volte perché la prima volta ho fatto il test veloce e mi ha dato come errore: 4HDD/11/40000004: SATA (0,0). La seconda volta ho fatto un test approfondito e mi ha dato: 4MEM/62/40000000: 0x84eaa518 La terza volta ho rifatto il test veloce e mi diceva che non c’erano errori. La quarta e ultima volta ho rifatto il test approfondito e mi ha dato di nuovo: 4mem/62/40000000: 0x84eaa518. Prima che succedesse questa cosa non ho fatto niente di anomalo a parte Disinstallare e reinstallare alcuni programmi della suite Adobe (per cambiare lingua) e ho cambiato lingua dalle impostazioni a MacOs. altre cose da segnalare ho cambiato L batteria ma tipo 4/5 mesi fa e le SSD circa 2 anni fa. Il resto dell’hardware è originale.
  2. Ciao, qualche giorno fa, appena riavviato il mbp dallo standby, è rimasto per qualche secondo con la rotellina e poi è andato in freeze. L'ho lasciato freezato per qualche minuto e subito dopo ha iniziato con dei beep, tre beep continuativi, poi una pausa e di nuovo tre beep. Ho spento, riacceso e nessun problema, nessun messaggio sulla console, all'apparenza nessun problema. Ho eseguito l'HW Test di Apple senza riscontrare nessuna anomalia. Qualche giorno fa ho trovate su un torrent la suite ASD (Apple Service Diagnostic) per la mia macchina (MacBook Pro Retina Mid 2012). Tutti i test sono andati bene tranne, ahime, questi 3. Il portatile ha l'apple care quindi non mi preoccupo, ma vorrei evitare di portarlo in assistenza e lasciarlo li qualche giorno... Qualcuno di voi sa cosa puo' essere e se è una cosa grave ? questi gli errori: [07/15/13 07:02:58] AirPort (test #9) - Wireless Module PCIe Root Port Hardware Register Test - Verifies PCIe root port error bits for wireless module doesn't register any NAKs [07:02:59] ERROR - -12100 [iOConnect error reading from PCI address space] -- TEST FAILED [07/15/13 07:04:27] AirPort (test #47) - Sleep Wake PCIe Error Count Screen Test - Performs sleep wake cycles and verifies module presence and the total PCIe correctable error count for both module and its bridge within test limit.\ [07:05:20] ERROR -- 44 [Module becomes missing upon sleep wake cycles] -- TEST FAILED [07/15/13 07:05:21] SATA: SATA PCI Register Test (test #1) - SATA PCI Register Test - Checks the SATA link error registers for dropped data packets using direct PCI access. [07:05:21] ERROR - -12105 [PCI driver IOService open error] -- TEST FAILED Grazie
×
×
  • Crea Nuovo...

Info

Per offrirti il miglior servizio possibile il sito utilizza cookies, anche di terze parti e profilazione. Utilizzando il sito acconsenti al loro impiego. Privacy Policy Termini di utilizzo